{"text_format":"3","workbook":"xlsx","n_sheets":15,"sheets":["Zadost - 1 list (2)","Nabidka_PRIV","adminSplatka","Splatka2","RPSN","adminBonita","Bonita2","adminStressDr","Zam_HU","Nabidka","Kalendar","Parametry","ALM_Hypo","DefProd","FIN_CLC"],"not_rendered":{"images":9,"macros":1,"external_links":2,"defined_names":429,"comments":6},"read":"whole","date_system":"1900"}

{"sheet":"Zadost - 1 list (2)","index":0,"n_rows":3,"n_cols":53,"rows_kept":3,"merged":[[2,0,2,12]]}
[]
[]
["ŽÁDOST",{"$nulls":49},{"$f":"_xlfn.SINGLE(manVerze)","v":"2026_04"},null,{"$f":"_xlfn.SINGLE(manVerze)","v":"2026_04"}]

{"sheet":"Nabidka_PRIV","index":1,"n_rows":61,"n_cols":46,"rows_kept":61,"merged":[[2,0,2,12],[13,9,13,26],[14,9,14,26],[15,9,15,26],[16,9,16,26],[18,22,18,37],[19,22,19,37],[20,22,20,37],[21,22,21,37],[22,22,22,37],[23,22,23,24],[24,22,24,26],[24,27,24,36],[25,22,25,37],[26,22,26,26],[26,27,26,36],[27,22,27,37],[28,22,28,34],[29,22,29,26],[30,22,30,34],[31,22,31,34],[32,4,32,37],[35,4,35,37],[36,5,36,36],[37,5,37,36],[38,5,39,36],[38,42,38,43],[40,5,40,36],[41,5,41,36],[44,4,44,37],[46,9,46,26],[47,9,47,26],[48,9,48,26],[49,9,49,26],[53,10,53,14],[53,15,53,19],[53,20,53,24],[53,25,53,29],[53,30,53,34],[53,35,53,39],[54,10,54,14],[54,15,54,19],[54,20,54,24],[54,25,54,29],[54,30,54,34],[54,35,54,39],[55,10,55,14],[55,15,55,19],[55,20,55,24],[55,25,55,29],[55,30,55,34],[55,35,55,39],[56,10,56,14],[56,15,56,19],[56,20,56,24],[56,25,56,29],[56,30,56,34],[56,35,56,39],[57,10,57,14],[57,15,57,19],[57,20,57,24],[57,25,57,29],[57,30,57,34],[57,35,57,39],[58,4,58,39],[60,4,62,37],[63,4,63,37],[65,4,66,37],[69,4,69,30],[70,4,70,30],[71,4,71,30],[72,4,72,30],[73,4,73,30],[74,4,74,30],[75,4,75,30],[76,4,76,30],[79,4,80,37],[83,4,83,30],[84,4,84,30],[85,4,85,30],[86,4,86,30],[87,4,87,30],[88,4,88,30],[89,4,89,30],[90,4,90,30],[91,4,91,30],[92,4,92,30],[95,4,96,37],[98,4,98,37],[99,6,99,34],[100,6,100,25],[101,4,102,37],[103,4,103,30],[108,4,108,30],[109,4,109,30],[110,4,110,30],[111,4,111,37],[112,4,112,30],[113,4,113,30],[114,4,114,30]]}
[]
[]
["NABÍDKA",{"$nulls":44},{"$f":"_xlfn.SINGLE(manVerze)","v":"2026_04"}]
[{"$nulls":4},"POUŽÍVEJTE PRO TISK NABÍDKY TLAČÍTKO VPRAVO NAHOŘE!!!!!"]
[]
[]
[]
[]
{"$rows_left_out":45}
{"sheet":"adminSplatka","index":2,"n_rows":140,"n_cols":18,"rows_kept":140,"hidden":true,"merged":[[1,1,2,3],[1,4,2,6]]}
[null,"dnešní datum",{"$f":"TODAY()","v":"2026-03-06"},{"$nulls":10},"Petra"]
[null,"Výpočet splátky",null,null,"Výpočet splátky pro Bonitu",{"$nulls":3},"Kontrola změny dat",{"$nulls":3},"2017-12-01",{"$f":"$O$2","v":0},{"$f":"+IF(AND(OR(TODAY()>ALM_Hypo!O2,TODAY()=ALM_Hypo!O2),OR(TODAY()<ALM_Hypo!O3,TODAY()=ALM_Hypo!O3)),1,0)","v":0},{"$f":"+IF(AND(OR(P3>ALM_Hypo!O2,P3=ALM_Hypo!O2),OR(P3<ALM_Hypo!O3,P3=ALM_Hypo!O3)),1,0)","v":0},null,"Privát"]
[{"$nulls":8},"Aktuální","Puvodni",{"$f":"AND(K4:K19)","v":false},{"$nulls":4},"2018-07-01"]
[null,"Produkt",{"$f":"VLOOKUP(TypHypoteky,ProductMap,2,FALSE)","v":"01a"},null,null,{"$f":"Product","v":"01a"},null,null,"Hypoteční úvěr účelový rezidenční Individual","Hypoteční úvěr účelový rezidenční Flexi",{"$f":"I4=J4","v":false}]
[null,"Žadatel",{"$f":"IF(MID(SplZadatel,7,2)=\"SR\",\"S\",MID(SplZadatel,1,1))","v":{"$error":"#NAME?"}},{"$nulls":5},{"v":2000000,"d":"2,000,000"},2000000,true,{"$nulls":5},"BMR",{"$f":"ALM_Hypo!D96","v":{"v":0.0354,"d":"3.54%"}}]
[null,"Rodné číslo",{"$f":"MID(SplRodneCislo,1,1)","v":{"$error":"#NAME?"}},{"$nulls":5}," "," ",{"$f":"I6=J6","v":true},{"$nulls":5},"Přirážka",{"$f":"+SazbaTrigger-nabidka_vyse_prirazky","v":{"v":-0.0354,"d":"-3.54%"}}]
[null,"Příjmy",{"$f":"MID(SplPrijmyV,1,1)","v":{"$error":"#NAME?"}},{"$f":"Zadatel&RodneCislo&Prijmy","v":{"$error":"#NAME?"}},{"$nulls":4},{"$f":"NemHodn","v":0},2180000,false]
[null,"Typ klienta",false,{"$f":"IF(C8=FALSE,\"Standardní klient\",\"Nestandardní klient\")","v":"Standardní klient"},"S",{"$nulls":3},{"v":0.667,"d":"67%"},0.918,false]
{"$rows_left_out":118}
{"sheet":"Splatka2","index":3,"n_rows":103,"n_cols":18,"rows_kept":103,"merged":[[2,0,2,4],[4,4,4,12],[5,3,5,7],[9,6,9,7],[9,15,9,16],[10,6,10,7],[10,15,10,16],[11,6,11,7],[12,6,12,7],[13,6,13,7],[14,6,14,7],[15,6,15,7],[15,15,15,16],[16,6,16,7],[16,15,16,16],[17,6,17,7],[17,15,17,16],[18,12,18,14],[18,15,18,16],[19,1,19,8],[20,15,20,16],[21,15,21,16],[24,2,26,5],[27,2,28,4],[29,2,29,3],[31,2,32,8],[36,2,36,3],[36,11,36,12],[37,2,37,3],[37,11,37,12],[39,2,39,6]]}
[]
[{"$nulls":17},"3P"]
["SPLÁTKA",{"$nulls":16},"2026_04"]
[]
[null,null,"Jméno a příjmení klienta",null,""]
[]
[]
[null,null,"Nemovitost a její parametry",{"$nulls":8},"Pojištění"]
{"$rows_left_out":38}
{"sheet":"RPSN","index":4,"n_rows":362,"n_cols":19,"rows_kept":362,"hidden":true}
["parametry z PSD",null,null,"číslo spl","datum spl","dělitel úroku RPSN","počet dnů","nenačerpáno","úrok","splátka","nesplacená jistina","splacení","hodnota každého období","současná hodnota","období",1,{"$f":"+B11","v":"2026-03-06"},{"$f":"+VyseUveruZaklad+vyseUveru2-B5-B14-B15-B16-B4","v":-3930}]
["výše úvěru",{"$f":"vyseUveru2+VyseUveruZaklad","v":0},null,0,{"$f":"DATE(YEAR(TODAY()),IF(OR(DAY(TODAY())>25,DAY(TODAY())=25),MONTH(TODAY())+1,MONTH(TODAY())),B10)","v":"2026-03-25"},{"$f":"IF(MOD(YEAR(E2),4) = 0,366,365)","v":365},{"$f":"E2-B11","v":19},null,{"v":0,"d":"0.00"},{"$f":"ROUND(B2*B3/100/360*G2,2)","v":{"v":0,"d":"0.00"}},{"$f":"B2","v":{"v":0,"d":"0.00"}},{"$f":"IF(K2>$B$8,FALSE,TRUE)","v":true},{"$f":"VyseUveruZaklad+vyseUveru2-J2","v":{"v":0,"d":"0.00"}},{"$f":"M2","v":{"v":0,"d":"0.00"}},null,{"v":2,"d":"2.00"},{"$f":"+E2","v":"2026-03-25"},{"$f":"-J2","v":{"v":0,"d":"0.00"}},{"$f":"-K2","v":{"v":0,"d":"0.00"}}]
["úrok",{"$f":"(UrSazba)*100","v":4.29},1,null,{"$f":"EDATE(E2,1)","v":"2026-04-25"},365,null,{"$f":"$B$9>=E3","v":false},{"$f":"ROUND(IF(H3,0,K2*$B$3/100/360*30),2)","v":{"v":0,"d":"0.00"}},{"$f":"IF(Pojisteni=\"Ano\",IF(L2=FALSE,ROUND(IF(H3,$B$2*$B$3/100/360*30,$B$8),2),ROUND(K2+I3,2))+(sazbaPoj*(VyseUveruZaklad+vyseUveru2)),IF(L2=FALSE,ROUND(IF(H3,$B$2*$B$3/100/360*30,$B$8),2),ROUND(K2+I3+IF(AND(L2,L1=FALSE),$B$14),2)))","v":{"v":0,"d":"0.00"}},{"$f":"IF(H3,$B$2,K2-J3+I3+IF(Pojisteni=\"Ano\",IF(L2,0,sazbaPoj*(VyseUveruZaklad+vyseUveru2)))+IF(AND(L2,L1=FALSE),$B$14,0))","v":{"v":0,"d":"0.00"}},{"$f":"IF(K3>$B$8,FALSE,TRUE)","v":true},{"$f":"-J3-IF(J3=0,0,VyseMesPoj)","v":{"v":0,"d":"0.00"}},{"$f":"M3/(1+kalkAPR)^SUM($O$3:O3)","v":0},{"$f":"1/12","v":0.08333333333333333},{"v":3,"d":"3.00"},{"$f":"+E3","v":"2026-04-25"},{"$f":"+M3","v":{"v":0,"d":"0.00"}}]
["poplatek za odhad",{"$f":"IF(LEFT(Product_Sub,2)=\"04\",splPoplOdhad,0)","v":0},null,2,"2026-05-25",365,null,{"$f":"$B$9>=E4","v":false},{"$f":"ROUND(IF(H4,0,K3*$B$3/100/360*30),2)","v":{"v":0,"d":"0.00"}},{"$f":"IF(Pojisteni=\"Ano\",IF(L3=FALSE,ROUND(IF(H4,$B$2*$B$3/100/360*30,$B$8),2),ROUND(K3+I4,2))+IF(L2,0,(sazbaPoj*(VyseUveruZaklad+vyseUveru2))),IF(L3=FALSE,ROUND(IF(H4,$B$2*$B$3/100/360*30,$B$8),2),ROUND(K3+I4+IF(AND(L3,L2=FALSE),$B$14),2)))","v":{"v":0,"d":"0.00"}},{"$f":"IF(H4,$B$2,K3-J4+I4+IF(Pojisteni=\"Ano\",IF(L3,0,sazbaPoj*(VyseUveruZaklad+vyseUveru2)))+IF(AND(L3,L2=FALSE),$B$14,0))","v":{"v":0,"d":"0.00"}},true,{"$f":"-J4-IF(J4=0,0,VyseMesPoj)","v":{"v":0,"d":"0.00"}},{"$f":"M4/(1+kalkAPR)^SUM($O$3:O4)","v":0},{"$f":"1/12","v":0.08333333333333333},{"v":4,"d":"4.00"},"2026-05-25",{"$f":"+M4","v":{"v":0,"d":"0.00"}}]
["poplatek za poskytnutí",{"$f":"IF(splPoplPoskZmena=\"\",splPoplPosk,splPoplPoskZmena)","v":0},"=KDYŽ(splPoplPoskZmena=\"\";splPoplPosk;splPoplPoskZmena)",3,"2026-06-25",365,null,false,{"$f":"ROUND(IF(H5,0,K4*$B$3/100/360*30),2)","v":{"v":0,"d":"0.00"}},{"$f":"IF(Pojisteni=\"Ano\",IF(L4=FALSE,ROUND(IF(H5,$B$2*$B$3/100/360*30,$B$8),2),ROUND(K4+I5,2))+IF(L3,0,(sazbaPoj*(VyseUveruZaklad+vyseUveru2))),IF(L4=FALSE,ROUND(IF(H5,$B$2*$B$3/100/360*30,$B$8),2),ROUND(K4+I5+IF(AND(L4,L3=FALSE),$B$14),2)))","v":{"v":0,"d":"0.00"}},{"$f":"IF(H5,$B$2,K4-J5+I5+IF(Pojisteni=\"Ano\",IF(L4,0,sazbaPoj*(VyseUveruZaklad+vyseUveru2)))+IF(AND(L4,L3=FALSE),$B$14,0))","v":{"v":0,"d":"0.00"}},true,{"v":0,"d":"0.00"},{"$f":"M5/(1+kalkAPR)^SUM($O$3:O5)","v":0},0.08333333333333333,{"v":5,"d":"5.00"},"2026-06-25",{"v":0,"d":"0.00"}]
["poplatek za účet",{"$f":"IF(SlevaUcet=\"Ano\",199,0)","v":0},null,4,"2026-07-25",365,null,false,{"$f":"ROUND(IF(H6,0,K5*$B$3/100/360*30),2)","v":{"v":0,"d":"0.00"}},{"v":0,"d":"0.00"},{"v":0,"d":"0.00"},true,{"v":0,"d":"0.00"},{"$f":"M6/(1+kalkAPR)^SUM($O$3:O6)","v":0},0.08333333333333333,{"v":6,"d":"6.00"},"2026-07-25",{"v":0,"d":"0.00"}]
["počet splátek jistiny",{"$f":"Splatnost","v":0},null,5,"2026-08-25",365,null,false,{"$f":"ROUND(IF(H7,0,K6*$B$3/100/360*30),2)","v":{"v":0,"d":"0.00"}},{"$f":"IF(Pojisteni=\"Ano\",IF(L6=FALSE,ROUND(IF(H7,$B$2*$B$3/100/360*30,$B$8),2),ROUND(K6+I7,2))+IF(L5,0,(sazbaPoj*(VyseUveruZaklad+vyseUveru2))),IF(L6=FALSE,ROUND(IF(H7,$B$2*$B$3/100/360*30,$B$8),2),ROUND(K6+I7+IF(AND(L6,L5=FALSE),$B$14),2)))","v":{"v":0,"d":"0.00"}},{"v":0,"d":"0.00"},true,{"v":0,"d":"0.00"},{"$f":"M7/(1+kalkAPR)^SUM($O$3:O7)","v":0},0.08333333333333333,{"v":7,"d":"7.00"},"2026-08-25",{"v":0,"d":"0.00"}]
["výše splátek",{"$f":"SplatkaAPR","v":{"v":6214,"d":"6,214"}},null,6,"2026-09-25",365,null,false,{"v":0,"d":"0.00"},{"$f":"IF(Pojisteni=\"Ano\",IF(L7=FALSE,ROUND(IF(H8,$B$2*$B$3/100/360*30,$B$8),2),ROUND(K7+I8,2))+IF(L6,0,(sazbaPoj*(VyseUveruZaklad+vyseUveru2))),IF(L7=FALSE,ROUND(IF(H8,$B$2*$B$3/100/360*30,$B$8),2),ROUND(K7+I8+IF(AND(L7,L6=FALSE),$B$14),2)))","v":{"v":0,"d":"0.00"}},{"$f":"IF(H8,$B$2,K7-J8+I8+IF(Pojisteni=\"Ano\",IF(L7,0,sazbaPoj*(VyseUveruZaklad+vyseUveru2)))+IF(AND(L7,L6=FALSE),$B$14,0))","v":{"v":0,"d":"0.00"}},true,{"v":0,"d":"0.00"},{"$f":"M8/(1+kalkAPR)^SUM($O$3:O8)","v":0},{"$f":"1/12","v":0.08333333333333333},{"v":8,"d":"8.00"},"2026-09-25",{"v":0,"d":"0.00"}]
{"$rows_left_out":355}
{"sheet":"adminBonita","index":5,"n_rows":148,"n_cols":24,"rows_kept":148,"hidden":true,"merged":[[1,8,2,8],[4,8,5,8],[7,5,7,6],[7,8,8,8],[19,1,19,2],[19,5,19,6],[20,1,20,2],[20,5,20,6],[35,1,35,2],[35,5,35,6],[113,2,113,3],[125,1,125,2],[125,8,125,9],[143,4,143,5],[143,11,143,12],[145,2,147,2],[145,9,147,9]]}
[{"$nulls":20},"BonDomacnosti",{"$f":"BonDomacnosti","v":"Ano"},null,"list renta"]
[null,"VYPOČTENÉ PŘÍJMY","žadatel","Spolužadatel",null,"VYPOČTENÉ VÝDAJE","Spolužadatel",null,"Koeficient splátky","KTK","KK",{"$nulls":9},"Dospeli",{"$f":"Dospeli","v":1},null,"policie, vojáci"]
[null,"Závislá",{"$f":"C22","v":0},{"$f":"G22","v":0},null,"Náklady na domácnost",{"$f":"IF(SpoDomacnost=\"\",0,MAX(SpoProhVB,SpoDomacnost))","v":0},null,null,{"v":0.034,"d":"3.40%"},{"v":0.029,"d":"2.90%"},{"$nulls":9},"Deti",{"$f":"Deti","v":0},null,"horníci"]
[null,"Daňové",{"$f":"C44+E40","v":0},{"$f":"G44+I40","v":0},null,"Osobní náklady",{"$f":"IF(SpoOsobni=\"\",0,MAX(SpoProhlOV,SpoOsobni))","v":0},{"$nulls":13},"Bydliste",{"$f":"Bydliste","v":"Praha"},null,"Hasičský záchranný sbor ČR"]
[null,"Hrubé",{"$f":"IF(HrubyVysledny=\"\",0,HrubyVysledny)","v":0},{"$f":"IF(SpoHrubyVysledny=\"\",0,SpoHrubyVysledny)","v":0},{"$nulls":4},"Pojistné","závislá činnost","podnikání","max. základ","SP","ZP","min SP","min ZP",{"$nulls":4},"Splatky",{"$f":"Splatky","v":0},null,"Celní správa ČR"]
[null,"Ostatní",{"$f":"D63","v":0},{"$f":"H63","v":0},null,"Daň",{"v":0.15,"d":"15.00%"},null,null,{"v":0.11,"d":"11.00%"},{"v":0.2135,"d":"21.35%"},{"v":1438992,"d":"1,438,992"},{"v":0.292,"d":"29.20%"},{"v":0.135,"d":"13.50%"},{"$f":"2189*12","v":{"v":26268,"d":"26,268"}},{"$f":"2024*12","v":{"v":24288,"d":"24,288"}},{"$nulls":4},"KTK",{"$f":"KTK","v":0},null,"Vězeňská služba ČR"]
[null,"Přímé",{"$f":"IF(PrimeMesicni=\"\",0, IF(AND(vykonprace=\"NE\",ObcanEHP=\"NE\"),kurz*0.8* PrimeMesicni,IF(mena3=\"Kč\", PrimeMesicni,(kurz*0.8* PrimeMesicni))))","v":0},{"$f":"IF(SpoPrimeMesicni=\"\",0, IF(spovykonprace=\"NE\",Spokurz*0.8* SpoPrimeMesicni,IF(spomena3=\"Kč\", SpoPrimeMesicni,(Spokurz*0.8*SpoPrimeMesicni))))","v":0},{"$nulls":16},"VydPojisteni",{"$f":"VydPojisteni","v":{"$error":"#NAME?"}},null,"GIBS"]
[null,"Vlastní",{"$f":"IF(VlastniVysledny=\"\",0,VlastniVysledny)","v":0},{"$f":"IF(SpoVlastniVysledny=\"\",0,SpoVlastniVysledny)","v":0},{"$nulls":4},"Podnikání stropy","max","min","min SP","min ZP",{"$nulls":7},"VydOstatni",{"$f":"VydOstatni","v":0},null,"BIS"]
{"$rows_left_out":141}
{"sheet":"Bonita2","index":6,"n_rows":86,"n_cols":33,"rows_kept":86,"merged":[[2,1,2,4],[3,4,3,7],[3,11,3,12],[3,14,3,15],[4,4,4,10],[4,11,4,12],[7,11,11,13],[7,14,7,15],[9,14,10,15],[14,5,14,7],[14,10,14,12],[28,5,28,7],[66,1,66,4],[69,1,69,4],[69,10,70,10],[69,12,70,12],[70,1,70,4],[81,1,81,4]]}
[{"$nulls":32},"Bonita není dostatečná."]
[]
[null,"BONITA",{"$nulls":11},{"$f":"_xlfn.SINGLE(manVerze)","v":"2026_04"}]
[]
[null,"Jméno a příjmení klienta",null,null,{"$f":"IF(SplatkaJmenoKlienta=\"\",\"\",SplatkaJmenoKlienta)","v":""}]
[]
[]
[null,"Úroková sazba",null,null,{"$f":"SazbaTrigger","v":{"v":0,"d":"0.00%"}},null,null,"Max. možná výše úvěru",null,null,{"$f":"IF(adminCelkovePrijmy=0,\"\",adminBonita!B89)","v":""},"Vyplňte příjmy a výdaje a zmáčkněte tlačítko vyhodnotit."]
{"$rows_left_out":79}
{"sheet":"adminStressDr","index":7,"n_rows":41,"n_cols":9,"rows_kept":41,"hidden":true,"merged":[[1,2,1,3],[2,1,2,3],[3,1,7,1],[3,2,3,3],[4,2,4,3],[5,2,5,3],[6,2,6,3],[7,2,7,3],[8,2,8,3],[10,2,10,3],[11,1,11,3],[12,1,15,1],[12,2,12,3],[13,2,13,3],[14,2,14,3],[15,2,15,3],[16,2,16,3],[18,1,18,3],[20,1,20,3],[22,2,22,3],[23,2,23,3],[24,1,28,1],[24,2,24,3],[25,2,25,3],[26,2,26,3],[27,2,27,3],[28,2,28,3],[29,2,29,3]]}
[]
[null,"DTI","A/B",null,{"$f":"StressDrA/StressDrB","v":{"$error":"#DIV/0!"}},null,"POSOUZENÍ NA UDW",null,{"$f":"IF(AND(bonDostatecna=\"Ano\",dtiDstiLtvNad+StressDrNad>0),1,0)","v":{"$error":"#NAME?"}}]
[null,"  A",null,null,{"$f":"SUM(E4:E8)","v":0},null,"DTI > 8 & DSTI > 40% & LTV > 80% & Regulatory LTV > 80%",null,{"$f":"IF(DtiNad+DstiNad+LtvNad+RegulatoryLtvNad=4,1,0)","v":{"$error":"#DIV/0!"}}]
[null,null,"financovaná částka požadovaného úvěru (včetně up-front CPI)",null,{"$f":"StressDrVyseUveru","v":0},null,"DTI > 8",8,{"$f":"IF(Dti>DtiNadLimit,1,0)","v":{"$error":"#DIV/0!"}}]
[null,null,"  + suma zbytkových jistin stávajících HU – suma zbytkových jistin refinancovaných HU",{"$nulls":3},"DSTI > 40%",{"v":0.4,"d":"40.00%"},{"$f":"IF(Dsti>DstiNadLimit,1,0)","v":{"$error":"#DIV/0!"}}]
[null,null,"  + suma zbytkových jistin a stávajících SU – suma zbytkových jistin refinancovaných SU ",{"$nulls":3},"LTV > 80%",{"v":0.8,"d":"80.00%"},{"$f":"IF(StressDrLtv>LtvNadLimit,1,0)","v":{"$error":"#DIV/0!"}}]
[null,null,"  + suma celkových limitů KK – suma celkových limitů refinancovaných/rušených KK",null,{"$f":"KK+SpoSplatky+SpoKk","v":0},null,"Regulatory LTV > 80%",{"v":0.8,"d":"80.00%"},{"$f":"IF(StressDrRegulatoryLtv>RegulatoryltvNadLimit,1,0)","v":{"$error":"#DIV/0!"}}]
[null,null,"  + suma celkových limitů KTK – suma celkových limitů refinancovaných/rušených KTK",null,{"$f":"KTK+SpoKtk","v":0},null,"STRESS DR > 100%",{"v":1,"d":"100.00%"},{"$f":"IF(StressDr>StressDrNadLimit,1,0)","v":0}]
{"$rows_left_out":25}
{"sheet":"Zam_HU","index":8,"n_rows":12,"n_cols":18,"rows_kept":12,"merged":[[2,0,2,4],[4,6,4,7],[6,6,6,7],[6,11,6,12],[6,16,6,17],[8,6,8,7],[10,6,10,7]]}
[]
[]
["Příjem zaměstnance",{"$nulls":16},{"$f":"_xlfn.SINGLE([0]!manVerze)","v":"2026_04"}]
[]
[null,null,"Minimální požadovaný čistý měsíční příjem:",{"$nulls":3},{"$f":"+adminBonita!C92","v":{"v":0,"d":"0 Kč"}}]
[]
[null,null,"Disponibilní příjem:",{"$nulls":3},{"$f":"(adminDisponibilniZdroje)","v":{"v":-13914.699999999999,"d":"-13,915 Kč"}},null,"=","Příjem celkem:",null,{"$f":"adminCelkovePrijmy","v":0},null,"-","Výdaje celkem:",null,{"$f":"adminCelkovyVydaj","v":{"v":13914.699999999999,"d":"13,915"}}]
[]
{"$rows_left_out":5}
{"sheet":"Nabidka","index":9,"n_rows":146,"n_cols":53,"rows_kept":146,"hidden":true,"merged":[[2,0,2,12],[13,9,13,26],[14,9,14,26],[15,9,15,26],[16,9,16,26],[18,22,18,37],[19,22,19,37],[20,22,20,37],[21,22,21,37],[22,22,22,37],[23,22,23,24],[23,27,23,36],[24,22,24,26],[24,27,24,35],[25,22,25,37],[26,22,26,26],[26,27,26,36],[27,22,27,37],[28,22,28,34],[29,22,29,26],[30,22,30,34],[31,22,31,26],[31,27,31,31],[31,32,31,34],[32,4,32,37],[35,4,35,37],[36,5,36,36],[37,5,37,36],[38,5,39,36],[38,42,38,43],[40,5,40,36],[41,5,41,36],[43,4,43,37],[45,9,45,26],[46,9,46,26],[47,9,47,26],[48,9,48,26],[50,4,51,39],[52,10,52,14],[52,15,52,24],[52,25,52,34],[53,10,53,14],[53,15,53,19],[53,20,53,24],[53,25,53,29],[53,30,53,34],[53,35,53,39],[54,15,54,23],[54,25,54,29],[54,30,54,34],[54,35,54,39],[55,10,55,14],[55,15,55,23],[55,25,55,29],[55,30,55,34],[55,35,55,39],[56,10,56,14],[56,25,56,29],[56,30,56,34],[56,35,56,39],[57,4,57,39],[58,10,58,14],[58,15,58,19],[58,20,58,24],[58,25,58,29],[58,30,58,34],[58,35,58,39],[59,15,59,19],[59,20,59,24],[59,25,59,29],[59,30,59,34],[59,35,59,39],[60,15,60,19],[60,20,60,24],[60,25,60,29],[60,30,60,34],[60,35,60,39],[61,15,61,19],[61,20,61,24],[61,25,61,29],[61,30,61,34],[61,35,61,39],[62,15,62,19],[62,20,62,24],[62,25,62,29],[62,30,62,34],[62,35,62,39],[62,40,62,44],[63,25,63,29],[63,30,63,34],[63,35,63,39],[64,15,64,19],[64,20,64,24],[64,25,64,29],[64,30,64,34],[64,35,64,39],[65,15,65,19],[65,20,65,24],[65,25,65,29],[65,30,65,34],[65,35,65,39],[66,15,66,19],[66,20,66,24],[66,25,66,29],[66,30,66,34],[66,35,66,39],[67,15,67,19],[67,20,67,24],[67,25,67,29],[67,30,67,34],[67,35,67,39],[68,15,68,19],[68,20,68,24],[68,25,68,29],[68,30,68,34],[68,35,68,39],[74,4,76,37],[79,4,79,37],[80,4,80,37],[87,4,87,37],[91,4,91,37],[92,4,92,37],[96,4,96,37],[100,4,100,37],[104,4,104,37],[108,4,108,37],[109,4,109,37],[113,4,113,37],[117,4,117,37],[121,4,121,37],[125,4,126,37],[128,4,128,37],[129,4,129,37],[130,4,130,37],[131,4,132,37],[133,4,133,30],[139,4,139,30],[140,4,140,30],[141,4,141,30],[142,4,142,30]]}
[]
[]
["NABÍDKA",{"$nulls":44},{"$f":"_xlfn.SINGLE(manVerze)","v":"2026_04"}]
[{"$nulls":4},"POUŽÍVEJTE PRO TISK NABÍDKY TLAČÍTKO VPRAVO NAHOŘE!!!!!"]
[]
[]
[]
[]
{"$rows_left_out":139}
{"sheet":"Kalendar","index":10,"n_rows":386,"n_cols":7,"rows_kept":386,"merged":[[2,1,2,6],[13,1,13,6],[15,1,15,6]]}
[]
[]
[null,"Orientační splátkový kalendář hypotečního úvěru"]
[]
[null,"Typ produktu",null,null,{"$f":"Nabidka!W19","v":"Hypotéka účelová"}]
[null,"Výše úvěru",null,null,{"$f":"RPSN!B2","v":{"v":0,"d":"0 Kč"}}]
[null,"Fixní období",null,null,{"$f":"Nabidka!W22","v":"3 roky"}]
[null,"Doba splatnosti",null,null,{"$f":"RPSN!B7","v":0}]
{"$rows_left_out":379}
{"sheet":"Parametry","index":11,"n_rows":148,"n_cols":16,"rows_kept":148,"hidden":true}
["Retail",{"$nulls":9},"Privát"]
["Splátka"]
["Typ hypotéky"]
["Povolené produkty","Prod Kód","Product_name"]
["Hypotéka účelová","01a","ucelova",{"$nulls":12},"FIXlistPriv"]
["Hypotéka kombinovaná","01e","kombinovana",{"$nulls":7},"splátka - marketingová sleva",{"$nulls":4},"Float"]
["Hypotéka neúčelová","03","neucelova",{"$nulls":7},"Private banker ",{"v":0.08,"d":"8.00%"},null,"bez kompetence ",null,"1 ROK"]
["Hypotéka předem","04","nespecka",{"$nulls":7},"Private banker (investment clients)",{"v":0.08,"d":"8.00%"},null,"Private banker ",null,"2 ROKY"]
{"$rows_left_out":141}
{"sheet":"ALM_Hypo","index":12,"n_rows":100,"n_cols":15,"rows_kept":100,"hidden":true,"merged":[[0,8,0,11],[0,13,0,14],[5,1,5,11],[6,1,6,11],[9,3,9,12],[11,3,11,12],[13,3,13,12],[15,3,15,12],[17,3,17,12],[18,3,18,12],[19,3,19,12],[20,3,20,12],[21,3,21,12],[22,3,22,12],[23,3,23,12],[24,3,24,12],[25,3,25,12],[27,3,27,12],[29,3,29,12]]}
[{"$nulls":8},"Jen pro vnitřní potřebu !",{"$nulls":4},"Platnost pro období"]
[{"$nulls":13},"Od:","2026-03-11"]
[{"$nulls":13},"Do:","2026-04-26"]
[]
[{"$nulls":13},"Zdroje platí "]
[null,"Tabulka referenčních úrokových sazeb pro standardní hypotéční úvěry v CZK\nČeská republika",{"$nulls":11},"Od:","2026-03-11"]
[null,"(úvěry pro úvěry do 20 mio. CZK)",{"$nulls":11},"Do:","2026-04-26"]
[]
{"$rows_left_out":87}
{"sheet":"DefProd","index":13,"n_rows":11,"n_cols":13,"rows_kept":11,"hidden":true}
["TYP_ID","PRODUCT","VYSE_MIN","MINTEXT","VYSE_MAX","MAXTEXT","FIXACE","SPLATNOST_MIN","SPLATNOST_MAX","MAXBEZALM","VEK_MIN","VEK_MAX","LTV Max"]
["01a_N","Hypoteční úvěr účelový rezidenční Individual",200000,"200.000",999999999,"999.999.999","Float, 1 rok, 2 roky, 3 roky, 5 let, 7 let, 10 let, 4 roky, 5 let, 6 let, 7 let, 8 let, 9 let, 10 let",12,300,20000000,18,99,100]
["01a_S","Hypoteční úvěr účelový rezidenční Individual",200000,"200.000",999999999,"999.999.999","Float, 1 rok, 2 roky, 3 roky, 5 let, 7 let, 10 let, 4 roky, 5 let, 6 let, 7 let, 8 let, 9 let, 10 let",12,360,20000000,18,99,100]
["01e_N","Hypoteční úvěr účelový rezidenční Twin",200000,"200.000",999999999,"999.999.999","Float, 1 rok, 2 roky, 3 roky, 5 let, 7 let, 10 let, 4 roky, 5 let, 6 let, 7 let, 8 let, 9 let, 10 let",12,300,20000000,18,99,100]
["01e_S","Hypoteční úvěr účelový rezidenční Twin",200000,"200.000",999999999,"999.999.999","Float, 1 rok, 2 roky, 3 roky, 5 let, 7 let, 10 let, 4 roky, 5 let, 6 let, 7 let, 8 let, 9 let, 10 let",12,360,20000000,18,99,100]
["03_N","Hypoteční úvěr neúčelový",200000,"200.000",999999999,"999.999.999","Float, 1 rok, 2 roky, 3 roky, 5 let, 7 let, 10 let, 4 roky, 5 let, 6 let, 7 let, 8 let, 9 let, 10 let",12,240,20000000,18,99,70]
["03_S","Hypoteční úvěr neúčelový",200000,"200.000",999999999,"999.999.999","Float, 1 rok, 2 roky, 3 roky, 5 let, 7 let, 10 let, 4 roky, 5 let, 6 let, 7 let, 8 let, 9 let, 10 let",12,240,20000000,18,99,70]
["04_N","Hypotéka předem",200000,"200.000",999999999,"999.999.999","Float, 1 rok, 2 roky, 3 roky, 5 let, 7 let, 10 let, 4 roky, 5 let, 6 let, 7 let, 8 let, 9 let, 10 let",12,360,{"$nulls":3},80]
{"$rows_left_out":4}
{"sheet":"FIN_CLC","index":14,"n_rows":469,"n_cols":20,"rows_kept":469,"hidden":true,"merged":[[1,2,1,7],[2,3,2,6],[3,2,3,3],[5,3,5,6],[7,4,7,5],[11,4,11,5],[13,4,13,5],[15,3,15,5],[17,3,17,5],[20,3,20,4],[20,5,20,6],[22,3,22,6],[25,5,25,6],[27,1,31,11]]}
[{"$nulls":17},"0"," roků"," měsíců"]
[null,null,"Pomocník při výpočtu splatnosti v EUROSIGovských úvěrových aplikacích",{"$nulls":6},"max délka dle typu produktu",{"$f":"+IF(ProduktList=\"U hypotéka neúčelová\",240,360)","v":360},{"$nulls":6},"1"," rok"," měsíc"]
[{"$nulls":17},"2"," roky"," měsíce"]
[null,null,"Zadejte typ úvěru",{"$nulls":10},4,{"$nulls":3},"3"," roky"," měsíce"]
[{"$nulls":12},{"$f":"+TODAY()","v":"2026-03-06"},{"$f":"IF(TODAY()<+DATE(YEAR(TODAY()),MONTH(TODAY()),DAY(25)),+DATE(YEAR(TODAY()),MONTH(TODAY()),DAY(25)),EDATE(+DATE(YEAR(TODAY()),MONTH(TODAY()),DAY(25)),1))","v":"2026-03-25"},{"$f":"DAY(N5)","v":25},null,null,"4"," roky"," měsíce"]
[{"$nulls":3},"FIN - parametry:",{"$nulls":9},{"$f":"MID(I8,1,30)","v":{"$error":"#NAME?"}}]
[{"$nulls":13},{"$f":"MID(I12,1,30)","v":""}]
[{"$nulls":3},"ASD","(doba čerpání)",null,{"$f":"DatumDocerpani","v":{"$error":"#NAME?"}},{"$f":"IF(G8=1,\"měsíc\",IF(OR(G8=2,G8=3,G8=4),\"měsíce\",\"měsíců\"))","v":{"$error":"#NAME?"}},{"$f":"IF(OR(N4=1,N4=3),IF(G8>0,\"POZOR!!! Vyplňte pouze hodnotu: 0\",\"\"),IF(OR(N4=2,N4=5),IF(G8>6,\"POZOR!!! Vyplňte pouze hodnotu: 0-6\",\"\"),IF(N4=7,IF(G8>6,\"POZOR!!! Vyplňte pouze hodnotu: 0-6\",\"\"),IF(N4=6,IF(G8>18,\"POZOR!!! Vyplňte pouze hodnotu: 0-18\",\"\"),IF(G8>24,\"POZOR!!! Vyplňte pouze hodnotu: 0-24\",\"\")))))","v":{"$error":"#NAME?"}},{"$nulls":4},{"$f":"FinKonecUveru-Vek/365","v":{"$error":"#NAME?"}}]
{"$rows_left_out":461}